﻿"Item Id","Item URI","Dublin Core:Title","Dublin Core:Creator","Dublin Core:Subject","Dublin Core:Description","Dublin Core:Source","Dublin Core:Publisher","Dublin Core:Date","Dublin Core:Contributor","Dublin Core:Rights","Dublin Core:Relation","Dublin Core:Format","Dublin Core:Language","Dublin Core:Type","Dublin Core:Identifier","Dublin Core:Coverage","Item Type Metadata:Occupation","Item Type Metadata:Bibliography","Item Type Metadata:Biographical Text","Item Type Metadata:Death Date","Item Type Metadata:Place of Publication","Item Type Metadata:Date Created","Item Type Metadata:Volume","Item Type Metadata:Issue","Item Type Metadata:Extent of Work","Item Type Metadata:Abstract","Item Type Metadata:Table of Contents","Item Type Metadata:Dimensions","Item Type Metadata:Medium","Item Type Metadata:Rights Statement","Item Type Metadata:Genre","Item Type Metadata:Subject Line","Item Type Metadata:Interviewer","Item Type Metadata:Interviewee","Item Type Metadata:Location","Item Type Metadata:Transcription","Item Type Metadata:Local URL","Item Type Metadata:Original Format","Item Type Metadata:Physical Dimensions","Item Type Metadata:Duration","Item Type Metadata:Compression","Item Type Metadata:Producer","Item Type Metadata:Director","Item Type Metadata:Bit Rate/Frequency","Item Type Metadata:Time Summary","Item Type Metadata:Email Body","Item Type Metadata:Text","Item Type Metadata:From","Item Type Metadata:To","Item Type Metadata:CC","Item Type Metadata:BCC","Item Type Metadata:Number of Attachments","Item Type Metadata:Standards","Item Type Metadata:Objectives","Item Type Metadata:Materials","Item Type Metadata:Lesson Plan Text","Item Type Metadata:URL","Item Type Metadata:Event Type","Item Type Metadata:Participants","Item Type Metadata:Birth Date","Item Type Metadata:Birthplace",tags,file,itemType,collection,public,featured
1632,https://search.mctclibraryzines.com/cms/items/show/1632,Rollmag,"Maue, Kenneth","History^^ Politics^^ Economics","'It Jiggles Your Thinking'",,,,,,,,,,Z02897,,,,,,"Mill Valley, California, United States",,,23,4,,,,,,,,,,,,,,,,,,,,,,,,,,,,,,,,,,,,,"Economics,History,Politics",,Zine,Zines,1,0
2192,https://search.mctclibraryzines.com/cms/items/show/2192,"Theory Of Alternative Green, The",,Economics,,,,,,,,,,,Z05568,,,,,,"Oxford, United Kingdom",,,,20,,,,,,,,,,,,,,,,,,,,,,,,,,,,,,,,,,,,,Economics,,Zine,Zines,1,0
2281,https://search.mctclibraryzines.com/cms/items/show/2281,"Here Be Dragons","Eric xxx","Technology^^ Economics^^ Zines^^ Environmental Protection^^ Politics","Gutter technologies and bottom-feeders",,,,,,,,,,Z05634,,,,,,"Pittsburgh, Pennsylvania, United States",1999,,6,36,,,,,,,,,,,,,,,,,,,,,,,,,,,,,,,,,,,,,"Economics,Environmental Protection,Politics,Technology,Zines",,Zine,Zines,1,0
2284,https://search.mctclibraryzines.com/cms/items/show/2284,"Here Be Dragons","Meisberber, Eric","Technology^^ Economics^^ Zines^^ Environmental Protection^^ Politics",,,,,,,,,,,Z05635,,,,,,"Pittsburgh, Pennsylvania, United States",,,8,44,,,,,,,,,,,,,,,,,,,,,,,,,,,,,,,,,,,,,"Economics,Environmental Protection,Politics,Technology,Zines",,Zine,Zines,1,0
2613,https://search.mctclibraryzines.com/cms/items/show/2613,"Little Free Press","Mann, Ernest","Economics^^ Politics^^ Writing^^ Books^^ Reviews","Zine dedicated Ernest Mann's Priceless Economic System",,,,,,,,,,Z02172,,,,,,"Minneapolis, Minnesota, United States",1995-03-20,,115,2,,,,,,,,,,,,,,,,,,,,,,,,,,,,,,,,,,,,,"Books,Economics,Politics,Reviews,Writing",,Zine,Zines,1,0
2616,https://search.mctclibraryzines.com/cms/items/show/2616,"Little Free Press","Mann, Ernest","Economics^^ Politics^^ Writing^^ Books^^ Reviews","Zine dedicated Ernest Mann's Priceless Economic System",,,,,,,,,,Z02171,,,,,,"Minneapolis, Minnesota, United States",1995-03-09,,114,2,,,,,,,,,,,,,,,,,,,,,,,,,,,,,,,,,,,,,"Books,Economics,Politics,Reviews,Writing",,Zine,Zines,1,0
2618,https://search.mctclibraryzines.com/cms/items/show/2618,"Little Free Press","Mann, Ernest","Economics^^ Politics^^ Writing^^ Books^^ Reviews","Zine dedicated Ernest Mann's Priceless Economic System",,,,,,,,,,Z02174,,,,,,"Little Falls, Minnesota, United States",1995-08-25,,117,4,,,,,,,,,,,,,,,,,,,,,,,,,,,,,,,,,,,,,"Books,Economics,Politics,Reviews,Writing",,Zine,Zines,1,0
2620,https://search.mctclibraryzines.com/cms/items/show/2620,"Little Free Press","Mann, Ernest","Economics^^ Politics^^ Writing^^ Books^^ Reviews","Zine dedicated Ernest Mann's Priceless Economic System",,,,,,,,,,Z02173,,,,,,"Little Falls, Minnesota, United States",1995-08-07,,116,4,,,,,,,,,,,,,,,,,,,,,,,,,,,,,,,,,,,,,"Books,Economics,Politics,Reviews,Writing",,Zine,Zines,1,0
2622,https://search.mctclibraryzines.com/cms/items/show/2622,"Little Free Press","Mann, Ernest","Economics^^ Politics^^ Travel^^ Writing","Zine dedicated Ernest Mann's Priceless Economic System",,,,,,,,,,Z02176,,,,,,"Little Falls, Minnesota, United States",1994-03-15,,101,4,,,,,,,,,,,,,,,,,,,,,,,,,,,,,,,,,,,,,"Economics,Politics,Travel,Writing",,Zine,Zines,1,0
2625,https://search.mctclibraryzines.com/cms/items/show/2625,"Little Free Press","Mann, Ernest","Economics^^ Politics^^ Writing^^ Books^^ Reviews","Zine dedicated Ernest Mann's Priceless Economic System",,,,,,,,,,Z02175,,,,,,"Little Falls, Minnesota, United States",1995-10-30,,112,4,,,,,,,,,,,,,,,,,,,,,,,,,,,,,,,,,,,,,"Books,Economics,Politics,Reviews,Writing",,Zine,Zines,1,0
