﻿"Item Id","Item URI","Dublin Core:Title","Dublin Core:Creator","Dublin Core:Subject","Dublin Core:Description","Dublin Core:Source","Dublin Core:Publisher","Dublin Core:Date","Dublin Core:Contributor","Dublin Core:Rights","Dublin Core:Relation","Dublin Core:Format","Dublin Core:Language","Dublin Core:Type","Dublin Core:Identifier","Dublin Core:Coverage","Item Type Metadata:Occupation","Item Type Metadata:Bibliography","Item Type Metadata:Biographical Text","Item Type Metadata:Death Date","Item Type Metadata:Place of Publication","Item Type Metadata:Date Created","Item Type Metadata:Volume","Item Type Metadata:Issue","Item Type Metadata:Extent of Work","Item Type Metadata:Abstract","Item Type Metadata:Table of Contents","Item Type Metadata:Dimensions","Item Type Metadata:Medium","Item Type Metadata:Rights Statement","Item Type Metadata:Genre","Item Type Metadata:Subject Line","Item Type Metadata:Interviewer","Item Type Metadata:Interviewee","Item Type Metadata:Location","Item Type Metadata:Transcription","Item Type Metadata:Local URL","Item Type Metadata:Original Format","Item Type Metadata:Physical Dimensions","Item Type Metadata:Duration","Item Type Metadata:Compression","Item Type Metadata:Producer","Item Type Metadata:Director","Item Type Metadata:Bit Rate/Frequency","Item Type Metadata:Time Summary","Item Type Metadata:Email Body","Item Type Metadata:Text","Item Type Metadata:From","Item Type Metadata:To","Item Type Metadata:CC","Item Type Metadata:BCC","Item Type Metadata:Number of Attachments","Item Type Metadata:Standards","Item Type Metadata:Objectives","Item Type Metadata:Materials","Item Type Metadata:Lesson Plan Text","Item Type Metadata:URL","Item Type Metadata:Event Type","Item Type Metadata:Participants","Item Type Metadata:Birth Date","Item Type Metadata:Birthplace",tags,file,itemType,collection,public,featured
7987,https://search.mctclibraryzines.com/cms/items/show/7987,"Reality Now",,"Social Movements^^ Social Theory^^ Anarchism^^ Anarchist History^^ Insurrectionary Anarchism^^ Revolution^^ Revolutionary Politics^^ Activism^^ Anti-Racism^^ Direct Action^^ Anti-Capitalism^^ Community Education^^ Self-Education^^ Mutual Aid^^ Allyship^^ Anti-Authoritarianism^^ Ireland^^ Industrial Workers of the World (IWW)^^ Unions^^ Dropping Out^^ Unschooling^^ Environmental Activism^^ Resource Consumption^^ Class Privilege^^ Classism^^ Class Struggle^^ Anarchist Black Cross^^ Political Prisoners^^ Prison Activism^^ Prison Violence^^ Police Brutality^^ Comics^^ Poetry^^ South Africa^^ Indigenous Rights^^ Animal Rights^^ Feminism",,,,,,,,,,,,,,,,,"Toronto, Ontario, Canada",1988,,8,42,"A Canada based zine on direct action and social reform internationally.","Editorial -- The IWW is Here -- Enneskillen and the War in Ireland -- The Battle Continues -- Fuck School -- Prisoner-Workers Join IWW -- Letters -- Seeing Red on Mothers Day -- The Environment is a Class Issue -- Anarchist Black Cross -- ABC in North America -- Animal Liberation Activists Persecuted -- Letter from Katsuhisa Omori -- Wimmin Prisoners Survival Network -- ABC Notes -- Avi Naftel: transfer Denied -- Martin Foran: This is Murder -- The Dragon Breathes Again -- The Murrays: We Must See to Our Own -- ABC Prisoners -- Qualities of a Prisoner Ally -- Valeena Marishka: Institutionalized -- Direct Action in Technicolour -- Prison Correspondence -- ABC Contacts - Ohio 7: We call it Resistance -- Ecomedia Toronto -- Partiarchy is Our Prison -- No More Cops -- Monkey Di Work, Baboon Di Chop -- Fight Back Good, Not Good Enough -- General Security -- Data Sabotage -- Survival International -- This Poem is an Offering -- Warrior's Prayer -- Survival Network Information Centre -- Still Ona Move! -- South Africa: Liberation From the Nation -- Tips for Dental Students -- Insurrection and Informal Organization -- Constructive Criticism -- Anarchy in Poland -- When a Friend Goes Mad -- Lubicons Declare Autonomy -- Interview with Bernard Ominayak -- Our Mistakes -- Fire at Akwesasne -- Save the Stein -- Save Whose Rainforests? -- Animal Liberation and Native Struggles: A Debate -- Emergency Response: Beyond Collaboration -- "" I Fought Back for My Life"" --  Autonomous Communities: Strategies for Fighting Rape -- Reviews -- The Last Page ","20.5x 27.5",Newsprint,,"Political Zine",,,,,,,,,,,,,,,,,,,,,,,,,,,,,,,,,Zine,Zines,1,0
7978,https://search.mctclibraryzines.com/cms/items/show/7978,Slingshot,"Slingshot Collective","Palestine^^ Protests^^ Political Organizing^^ Disability^^ Disability Rights^^ Community Education^^ Support^^ Community^^ Neighborhoods^^ Unschooling^^ Animal Rights^^ Police Accountability^^ Police Brutality^^ Police Violence^^ Social Justice^^ Justice^^  Environmental Activism^^ Community Radio^^ Anti-War^^ Discrimination^^ Activism^^ Resistance^^ Assault^^ Trees^^ Abortion^^ Comics",,,"Slingshot Collective",,,,,,,,,,,,,,"Berkley, California, United States",2010,,104.1,8,"Slingshot is a quarterly, independent, radical, newspaper published in the East Bay since 1988 by the Slingshot Collective. They are an all volunteer, non-profit, tax exempt project of the Long Haul.",,"28 x 38 centimeters",Newsprint,,"Political Zine",,,,,,,,,,,,,,,,,,,,,,,,,,,,,,,,,Zine,Zines,1,0
7972,https://search.mctclibraryzines.com/cms/items/show/7972,"SLUG & LETTUCE","Boarts, Christine","Punk Music^^ Punk Shows^^ Punks^^ Music Reviews^^ Metal Music^^ Mutual Aid^^ Support^^ Allyship^^ Community^^ Anti-Capitalism^^ Individualism^^ DIY^^ Comics^^ Books",,,,,,,,,,,,,,,,,"Richmond, Virginia, United States",2002,,73,10,"A zine supporting the do-it-yourself ethics of the punk community","Zero Content -- Book Reviews -- Columns -- Reviews -- Zines -- Music Reviews -- Music -- Classifieds","28 x 38 centimeters",Newsprint,,Fanzine,,,,,,,,,,,,,,,,,,,,,,,,,,,,,,,,,Zine,Zines,1,0
7971,https://search.mctclibraryzines.com/cms/items/show/7971,"SLUG & LETTUCE","Boarts, Christine","Punk Music^^ Punk Shows^^ Punks^^ Music Reviews^^ Metal Music^^ Mutual Aid^^ Support^^ Allyship^^ Community^^ Anti-Capitalism^^ Individualism^^ DIY^^ Comics^^ Books",,,,,,,,,,,,,,,,,"Richmond, Virginia, United States",2004,,80,10,"A zine supporting the do-it-yourself ethics of the punk community","Dog Dayz -- Books -- Classifieds -- Columns -- Zine Reviews -- Zines -- Music Reviews -- Music -- ","28 x 38 centimeters",Newsprint,,Fanzine,,,,,,,,,,,,,,,,,,,,,,,,,,,,,,,,,Zine,Zines,1,0
7951,https://search.mctclibraryzines.com/cms/items/show/7951,Madonna/Whore,"Evenson, Sarah","Art^^ Comics^^ Narrative Comics^^ Art Galleries^^ Art History^^ Art Exhibition^^ Sculpture^^ Body Image^^ Body Positivity^^ Jesus Christ^^ Religion^^ Sex-Positive Feminism^^ Sexuality",,,,,,,,,,,,,,,,,"Minneapolis, Minnesota, United States",,,,16,"Drawings of Madonna and discussion of classical art, the female form, and the Madonna - Whore Complex inflicted onto women. ","Madonna and Child -- Madonna of the Book -- Madanna Litta -- Madonna Del Granduca -- Sistine Madonna --  Venus of Umbino -- The Birth of Venus -- Grande Odalisque -- Olympia -- Nude on a Couch","12 x 19 centimeters","Printed, color",,"Art Zine^^ Split Zine",,,,,,,,,,,,,,,,,,,,,,,,,,,,,,,,,Zine,Zines,1,0
7950,https://search.mctclibraryzines.com/cms/items/show/7950,"Silk Chains^^ Coast City Comicon Special Issue","Hessian, William^^ Oster, Karalee","Art^^ Comics^^ Narrative Comics^^ Superheroes^^ Water Supply^^ Environmental Activism^^ Activism^^ Fighting^^ Direct Action",,,,,,,,,,,,,,,,,"Portland, Maine, United States",2013-12,,34,24,"In 2003 SILK CHAINS was created as an open source zine/comic book adventure addressing politically charged scenarios around the planet. The comic was invented by a group of unknown activists in the midwest.",,"11 x 14 centimeters","Printed, color",,"Political Zine",,,,,,,,,,,,,,,,,,,,,,,,,,,,,,,,,Zine,Zines,1,0
7945,https://search.mctclibraryzines.com/cms/items/show/7945,"ROHO^^ Double Trouble","Holland, Rob","Truckers^^ Hitchhiking^^ Mythology^^ Comics",,,,,,,,,,,,,,,,,"Lakewood, Ohio, United States",2021-03,,3,16,"Reflections on being a trucker in Ohio.","Apocrypha Now Are We There Yeti? -- Apocrypha Now The Rime of the Ancient Teamster","7 x 10.5 centimeters",Printed,,"Personal Zine",,,,,,,,,,,,,,,,,,,,,,,,,,,,,,,,,Zine,Zines,1,0
7938,https://search.mctclibraryzines.com/cms/items/show/7938,"Reserve and renew^^ the LIS mental health zine","Pho, Annie^^ Williams, Abigale^^ Moreno Ortiz, Marisol^^ McElroy, Kelly^^ Gustavsen, Nicole^^ Fox, Violet^^ Deibel, Kate^^ Chenevey, Liz^^ Sophie^^ Kestrel^^ Chloe^^ Jacqueline (Jax)^^ Corble, Alice^^ Kelley, April^^ Jocson Portor, Alyssa^^ Char^^ Badillo, Luz^^ Toups, Megan^^ Grabmeier, Maggie^^ Kopkowski, Alexis^^ Smalltown Librarian^^ Hunasikatti, Monica^^ Salma A.^^ Taichman, Marsha^^ arianna^^ Ellie^^ Sheila G.M.^^ Shah, Mimosa ","Library Catalogues^^ Librarians^^ Zine Libraries^^ Libraries^^ Archives^^ Mental Health^^ Health^^ Poetry^^ Comics^^ Medication^^ Storytelling^^ Worker's Rights^^ Collaboration",,,,,,,,,,,,,,,,,,,,6,,"A compilation zine with submissions from people who work and volunterr in libraries or archives, (or are workign towards a library degree) exploring the intersections of mental health, mental illness and library/archives work. ",,"14 x 21.5 centimeters",,"All contributions are published under a Creative Commons Attribution-NonCommercial license (CC BY-NC 4.0).","Compilation Zine ",,,,,,,,,,,,,,,,,,,,,,,,,,,,,,,,,Zine,Zines,1,0
7937,https://search.mctclibraryzines.com/cms/items/show/7937,"Reserve and renew^^ the LIS mental health zine","Pho, Annie^^ Williams, Abigale^^ Donovan, Jess^^ McElroy, Kelly^^ Gustavsen, Nicole^^ Fox, Violet^^ Deibel, Kate^^ Chenevey, Liz^^ Rios, Maria^^ Jenni J^^ Donovan, J.^^ Astill, Stacey^^ Mona^^ Barbano, Luisa^^ Toups, Megan^^ Mikala Rae^^ AnonymousPotato^^ Gustavsen, N.^^ Lauren^^ Sarah Louise^^ Opuda, Eugenia^^ Patino, Jennifer^^ Gaines, Annie^^ Mueller, Janina^^ Bignoli, Callan^^ Morning, Nicole","Library Catalogues^^ Librarians^^ Zine Libraries^^ Libraries^^ Archives^^ Mental Health^^ Health^^ Poetry^^ Comics^^ Medication^^ Storytelling^^ Worker's Rights^^ Collaboration",,,,,,,,,,,,,,,,,,,,5,,"A compilation zine with submissions from people who work and volunterr in libraries or archives, (or are workign towards a library degree) exploring the intersections of mental health, mental illness and library/archives work. ",,"14 x 21.5 centimeters",,"All contributions are published under a Creative Commons Attribution-NonCommercial license (CC BY-NC 4.0).","Compilation Zine ",,,,,,,,,,,,,,,,,,,,,,,,,,,,,,,,,Zine,Zines,1,0
7936,https://search.mctclibraryzines.com/cms/items/show/7936,"Reserve and renew^^ the LIS mental health zine","Pho, Annie^^ Phillips, Abigale^^ Moreno Ortiz, Marisol^^ McElroy, Kelly^^ Gustavsen, Nicole^^ Fox, Violet^^ Deibel, Kate^^ Chenevey, Liz^^ Pinecones^^ Das, Hridi^^ Laika, Kit^^ Joranson, Kate^^ Lapka, Stephanie^^ Jac^^ Briggs Becker, Becky^^ Spencer, Katrina^^ Werner, Rachel^^ Magid, Amani^^ jumbo villa^^ Laura^^ Grace, Kassi^^ Ward, Kestrel^^ Anaya^^ Eremita, Victoria^^ Reitsma, Renee^^ Moss, Jennifer^^ Garcia, Sheila^^ Anderson, Teri^^ Beaver Batte, Elizabeth^^ @archivalarden ","Library Catalogues^^ Librarians^^ Zine Libraries^^ Libraries^^ Archives^^ Mental Health^^ Health^^ Poetry^^ Comics^^ Medication^^ Storytelling^^ Worker's Rights^^ Collaboration",,,,,,,,,,,,,,,,,,,,4,,"A compilation zine with submissions from people who work and volunterr in libraries or archives, (or are workign towards a library degree) exploring the intersections of mental health, mental illness and library/archives work. ",,"14 x 21.5 centimeters",,"All contributions are published under a Creative Commons Attribution-NonCommercial license (CC BY-NC 4.0).","Compilation Zine ",,,,,,,,,,,,,,,,,,,,,,,,,,,,,,,,,Zine,Zines,1,0
