﻿"Item Id","Item URI","Dublin Core:Title","Dublin Core:Creator","Dublin Core:Subject","Dublin Core:Description","Dublin Core:Source","Dublin Core:Publisher","Dublin Core:Date","Dublin Core:Contributor","Dublin Core:Rights","Dublin Core:Relation","Dublin Core:Format","Dublin Core:Language","Dublin Core:Type","Dublin Core:Identifier","Dublin Core:Coverage","Item Type Metadata:Occupation","Item Type Metadata:Bibliography","Item Type Metadata:Biographical Text","Item Type Metadata:Death Date","Item Type Metadata:Place of Publication","Item Type Metadata:Date Created","Item Type Metadata:Volume","Item Type Metadata:Issue","Item Type Metadata:Extent of Work","Item Type Metadata:Abstract","Item Type Metadata:Table of Contents","Item Type Metadata:Dimensions","Item Type Metadata:Medium","Item Type Metadata:Rights Statement","Item Type Metadata:Genre","Item Type Metadata:Subject Line","Item Type Metadata:Interviewer","Item Type Metadata:Interviewee","Item Type Metadata:Location","Item Type Metadata:Transcription","Item Type Metadata:Local URL","Item Type Metadata:Original Format","Item Type Metadata:Physical Dimensions","Item Type Metadata:Duration","Item Type Metadata:Compression","Item Type Metadata:Producer","Item Type Metadata:Director","Item Type Metadata:Bit Rate/Frequency","Item Type Metadata:Time Summary","Item Type Metadata:Email Body","Item Type Metadata:Text","Item Type Metadata:From","Item Type Metadata:To","Item Type Metadata:CC","Item Type Metadata:BCC","Item Type Metadata:Number of Attachments","Item Type Metadata:Standards","Item Type Metadata:Objectives","Item Type Metadata:Materials","Item Type Metadata:Lesson Plan Text","Item Type Metadata:URL","Item Type Metadata:Event Type","Item Type Metadata:Participants","Item Type Metadata:Birth Date","Item Type Metadata:Birthplace",tags,file,itemType,collection,public,featured
1308,https://search.mctclibraryzines.com/cms/items/show/1308,"Profane existence","Dan (editor)^^ Maygun (editor)^^ Joe (editor)^^ Adrienne^^ Ben & Jeff of Resist and Exist^^ Brian^^ Bondage, Chelsea^^ ciderpunk^^ Menzies, dan^^ Hatchet, Mollie^^ Newt^^ K, Special^^ Tacolypse^^ Zach","Music^^ Bands^^ Punk^^ Anarchism^^ Collectives^^ Protests^^ Fascism^^ Reproductive rights^^ Interviews^^ Reviews^^ Concerts^^ Band tours^^ Polyamory^^ Women in Prison","14-year anniversay issue^^ Fall-Winter 2003",,,,,,,,,,Z07569,,,,,,"Minneapolis, Minnesota, United States",2003,,44,12,"A punk newsletter","Actions-Events-Calendar -- Murder... it's the real thing -- Columns -- Arise! interview -- The women's prison book project --Â Redefining our relationships --Â Noise reviews -- Zine reviews -- Book reviews -- Resist and Exist Mexico tour 2003 -- Much to learn from a flourishing movement","44 x 29 centimeters","Printing Press",,,,,,,,,,,,,,,,,,,,,,,,,,,,,,,,,"Anarchism,Band Tours,Bands,Collectives,Concerts,Fascism,Interviews,Music,Polyamory,Protests,Punk,Reproductive Rights,Reviews,Women in Prison",,Zine,Zines,1,0
1361,https://search.mctclibraryzines.com/cms/items/show/1361,"Prison within the prison: resistance to the F.I.E.S isolation units in Spain","Anarchist Black Cross","Personal Stories^^ Anarchism^^ History^^ Activism^^ Prisons^^ Prisoners^^ Letters",,,,,,,,,,,Z07237,,,,,,"Portland, Oregon, United States",2005-11,,,40,"The Spanish state's prison system condemns political and rebellious prisoners to FIES isolation units, brutal and dehumanising ""prisons within the prisons."" This booklet shares thoughts and experiences of participants in the struggle against FIES.","Contents -- FIES en lucha, a short history of the prison struggle in Spain -- The prison inside the prison -- The 1999 communique -- Posthumous letter of Paco Ortiz -- Excerpts from Amanda Cerezo Garcia's letter -- Letter from Carol Forne Roig -- Letter from Michelle Pontolillo -- Message from Gabriel Beo Sampedro -- From the other side -- Contribution to the debate -- Critique and analysis of anarchism today - collective of libertarian prisoners of jaen 2 -- The prisons of democracy","28 x 22 centimeters","Printing Press",,"Political Zine",,,,,,,,,,,,,,,,,,,,,,,,,,,,,,,"Activism,Anarchism,History,Letters,Personal Stories,Prisoners,Prisons",,Zine,Zines,1,0
1503,https://search.mctclibraryzines.com/cms/items/show/1503,"Show Me The Money","Hunnicutt, Tony","Economics^^ Politics^^ Anarchism^^ Media^^ Money^^ Anti-Capitalism",,,,,,,,,,,Z07205,,,,,,"Coon Rapids, Minnesota, United States",2004,,19,40,"A zine criticizing the current economic system, establishing the truth about economic history, singling out corruption in the financial system, exposing its inherent inequality andn exploring possible alternatives to it.","Welcome -- Anniversary statement from Leonard Peltier -- Wage slavery -- Class based society -- The ""liberal"" New York Times -- Economics and The Wizard of Oz -- Gotta love that Wal-mart -- A fable -- A present for Rupert Murdoch -- Ruper Murdochâ€¦ Mr. Evil -- Fascism without fascism? -- What ever happened to peace on earth -- A U.S. employee ownership bank? -- On the FTAA protest in Miami, 11/03 -- Hunger and homelessness -- Oh, to be a billionaire -- Amnesty International blasts U.S. for human rights violation -- Working asses -- ""Devil's tears"" -- Oil shortages look certain after 2007 -- Finding 10 North Sea fields somewhere -- Eating fossil fuels -- The Pentagon's climate change threat assessment -- Hawks tell Bush how to win war on terror -- The abominable religion of the Ratheans -- The parable of the labourers -- Lowering the boom -- Fun facts -- Publications received","22 x 14 centimeters",Photocopied,,"Political Zine",,,,,,,,,,,,,,,,,,,,,,,,,,,,,,,"Anarchism,Anti-Capitalism,Economics,Media,Money,Politics",,Zine,Zines,1,0
1505,https://search.mctclibraryzines.com/cms/items/show/1505,"Show Me The Money","Hunnicutt, Tony","Economics^^ Politics^^ Anarchism^^ Media^^ Money^^ Anti-Capitalism^^ Prisons",,,,,,,,,,,Z07204,,,,,,"Coon Rapids, Minnesota, United States",2003,,18,48,"A zine criticizing the current economic system, establishing the truth about economic history, singling out corruption in the financial system, exposing its inherent inequality andn exploring possible alternatives to it.","Welcome -- World oil and gas ""running out"" -- Behind the New York blackout -- Jeep Cherokee -- What the hell did you think was gonna happen? -- Masters of war -- Homeland Security: when the phoenix comes home to roost -- Bullet in your head -- The marching song of the covert battalions -- Army dreamers -- Project for the new American century -- Jobless in the U.S.A. -- Man in black -- The idea of a legal economy -- Working class hero -- Lowering the boom: the layoff scorecard -- Fun facts -- Rep. Bernie Sanders grills greenspan on jobs going overseas -- Hide-the-pay-raise -- Job losses at level of Great Depression -- Bush election donors share $8 billion bonanza -- Health care -- Wal-Mart -- Wal-Mart needs more power? -- Target stores -- U.S. tops in prisoners -- Instrument of empire - spray on computers -- Saudis consider nuclear bomb -- Largest Arctic ice shelf breaks in two after 3,000 years -- At the top of the food chain, but the bottom of the line -- Studies documen housing diaster for millions in U.S. -- Poverty up for second year in a row -- Billionaire George Soros and MoveOn.org -- Even biggest firms now cut health insurance -- Only the billionaires -- Letters -- Publications received","22 x 14 centimeters",Photocopied,,"Political Zine",,,,,,,,,,,,,,,,,,,,,,,,,,,,,,,"Anarchism,Anti-Capitalism,Economics,Media,Money,Politics,Prisons",,Zine,Zines,1,0
1507,https://search.mctclibraryzines.com/cms/items/show/1507,"Show Me The Money","Hunnicutt, Tony","Economics^^ Politics^^ Anarchism^^ Media^^ Money^^ Anti-Capitalism",,,,,,,,,,,Z07203,,,,,,"Coon Rapids, Minnesota, United States",2003,,16,60,"A zine criticizing the current economic system, establishing the truth about economic history, singling out corruption in the financial system, exposing its inherent inequality andn exploring possible alternatives to it.","Welcome -- The three pillars of community economics -- A little story -- Mutalist anarchism: an introduction -- The history of money corner: the Canadian experience -- The tale of money creation -- King George's dilemma -- The end of the west: the decline of the dollar and the rise of the Euro? -- Black Wallstreet -- Local stores generate local business -- Rumsfeld was on board of company that sold North Korea two nuclear power plants -- Will the real George Sonos please stand up -- The apparent role of NGOs in all of this -- Flawed appeal -- The role of corporate media -- The Ford Foundation and the CIA: a documented case of philathropic collaboration within the secret police -- Alternative media censorship: sponsored by CIA's Ford Foundation? -- George Soros' ""parallel anti-war media/movement"" -- The Dartmouth Review and its ilk -- Steel company reneges on health care -- Ver-r-r-ry interesting -- Largest bankrupcies -- George W. Bush's America report on layoffs killed Show me the money: fun facts -- Somebody blew up America -- Masters of war -- Consumer debt looks set to keep soaring","22 x 14 centimeters",Photocopied,,"Political Zine",,,,,,,,,,,,,,,,,,,,,,,,,,,,,,,"Anarchism,Anti-Capitalism,Economics,Media,Money,Politics",,Zine,Zines,1,0
1514,https://search.mctclibraryzines.com/cms/items/show/1514,"Show Me The Money","Hunnicutt, Tony","Economics^^ Politics^^ Anarchism^^ Media^^ Money^^ Anti-Capitalism^^ Environmental Protection^^ Lists",,,,,,,,,,,Z07208,,,,,,"Coon Rapids, Minnesota, United States",2005,,21,48,"A zine criticizing the current economic system, establishing the truth about economic history, singling out corruption in the financial system, exposing its inherent inequality andn exploring possible alternatives to it.","Welcome -- A new American century? Iraq and the hidden euro-dollar wars -- Peak oil and depopulating Asia -- America to become net food importer by 2005 -- Lowering the boom: the layoff scoreboard -- The coming currency shock: declining superpower act -- Post-autistic economics: what economic students in three countries are doing to put their professors on the defensive -- What a bunch-a-moron's democrats are -- More relief for struggling millionaires -- The riddle of consumption -- Address to global conference on business and economics -- The need for anetwork of low income citizen-owned development credit unions -- Surprise CO2 risemay speed up global warming -- The disciplinary apparatus of welfare reform -- SMt$ attacked -- CSC-Dyn Corp -- Computer Sciences Corporation -- Publications received -- U.S.A. Patriot Act: conquering the American people","22 x 14 centimeters",Photocopied,,"Political Zine",,,,,,,,,,,,,,,,,,,,,,,,,,,,,,,"Anarchism,Anti-Capitalism,Economics,Environmental Protection,Lists,Media,Money,Politics",,Zine,Zines,1,0
1516,https://search.mctclibraryzines.com/cms/items/show/1516,"Show Me The Money","Hunnicutt, Tony","Economics^^ Politics^^ Anarchism^^ Media^^ Money^^ Anti-Capitalism^^ Jobs^^ Lists",,,,,,,,,,,Z07207,,,,,,"Coon Rapids, Minnesota, United States",2004,,20,40,"A zine criticizing the current economic system, establishing the truth about economic history, singling out corruption in the financial system, exposing its inherent inequality andn exploring possible alternatives to it.","Welcome -- The money myth exploded: the financial enigma resolved, a debt-money system -- Life at the top -- A world of usury -- Listen up -- Why dad can't afford dialysis -- Lowering the boom: the layoff scoreboard -- That silly Alan Greenspan -- In the beginning -- Who owns what: a media update -- Top U.S. officials hold fake degrees from universities -- Publications received","22 x 14 centimeters",Photocopied,,"Political Zine",,,,,,,,,,,,,,,,,,,,,,,,,,,,,,,"Anarchism,Anti-Capitalism,Economics,Jobs,Lists,Media,Money,Politics",,Zine,Zines,1,0
1517,https://search.mctclibraryzines.com/cms/items/show/1517,"Show Me The Money","Hunnicutt, Tony","Economics^^ Politics^^ Anarchism^^ Media^^ Money^^ Anti-Capitalism^^ Jobs",,,,,,,,,,,Z07206,,,,,,"Coon Rapids, Minnesota, United States",2003,,17,40,"A zine criticizing the current economic system, establishing the truth about economic history, singling out corruption in the financial system, exposing its inherent inequality andn exploring possible alternatives to it.","Welcome -- They know which side their bread is buttered on -- Money, refuge of authoritarian crowds -- One nation, ruled by millionaires -- I side ""with the traitors in this fight"" -- Here's a fable -- Open money manifesto -- One form of decentralization -- The hard right domestic agenda -- Business-as-usual: elements of an unhealthy economy -- The 14 defining characteristics of fascism -- The lion's roar sutra -- If the world is so rich, why the scarcity? -- Very sound song -- Black Hawk's surrender speech 1832 -- Oil and dollar -- Choices -- Even the Pope thinks 9-11 was an inside job -- Economic genocide -- Economic scorecard -- Very nice: House considers measures to cut billions in pension obligations -- Bush's tax crackdown -- Psalm 1936 -- Wal-Mart -- World's oceans wrecked -- Very richest's share of income grew even bigger -- UBS bank to cut about 500 investment banking jobs globally -- Lowering the boom: the layoff scoreboard -- Ain't that a kick in the nuts -- U.S. unemployment rate climbs to a 9-year high of 6.4% -- White-color jobs moving ahead -- U.S. leads world in execution of child offenders -- The real scoop on diebold -- Jails and bullets are the proper therapy for the poor -- Letters -- Publications received","22 x 14 centimeters",Photocopied,,"Political Zine",,,,,,,,,,,,,,,,,,,,,,,,,,,,,,,"Anarchism,Anti-Capitalism,Economics,Jobs,Media,Money,Politics",,Zine,Zines,1,0
1642,https://search.mctclibraryzines.com/cms/items/show/1642,"Drugs And Daydreams",,"Youth^^ Freedom^^ Anarchism","Roadtrip on bikes.",,,,,,,,,,Z06021,,,,,,"Portland, Oregon, United States",,,,48,"' 1,169 miles of beaches, new wave, and crime...on a fucking bike'",,,,,,,,,,,,,,,,,,,,,,,,,,,,,,,,,,,,"Anarchism,Freedom,Youth",,Zine,Zines,1,0
1655,https://search.mctclibraryzines.com/cms/items/show/1655,"News From Nowhere","Blake, Fay^^ Mort Newman","History^^ Writing^^ Politics^^ Globalization^^ Poetry^^ Anarchism",,,,,,,,,,,Z02911,,,,,,"Berkeley, California, United States",2000-09,,38,20,,,,,,,,,,,,,,,,,,,,,,,,,,,,,,,,,,,,,"Anarchism,Globalization,History,Poetry,Politics,Writing",,Zine,Zines,1,0
